BDBM9923 (2S)-2-(2-{3-[(2S)-2-[(2S)-2-cyclohexyl-2-{[(2-methylpropoxy)carbonyl]amino}acetamido]-3-(1,3-dithiolan-2-yl)propanamido]-2-oxohexanamido}acetamido)-2-phenylacetic acid::P2 side-chain modified alpha-ketoamide inhibitor 15
SMILES: CCCC(NC(=O)[C@H](CC1SCCS1)NC(=O)[C@@H](NC(=O)OCC(C)C)C1CCCCC1)C(=O)C(=O)NCC(=O)N[C@H](C(O)=O)c1ccccc1
InChI Key: InChIKey=WSNJYSNNBVYSQQ-ZQSABATQSA-N
Data: 1 KI
Activity Spreadsheet -- Enzyme Inhibition Constant Data from BindingDB
Found 1 hit for monomerid = 9923
Trg + Lig
Ki
nM
ΔG°
kcal/mole
IC50
nM
Kd
nM
EC50/IC50
nM
koff
s-1
kon
M-1s-1
pHTemp
°C
Genome polyprotein
(Hepatitis C virus (HCV genotype 1a, isolate H))
BDBM9923
((2S)-2-(2-{3-[(2S)-2-[(2S)-2-cyclohexyl-2-{[(2-met...)
Show SMILES CCCC(NC(=O)[C@H](CC1SCCS1)NC(=O)[C@@H](NC(=O)OCC(C)C)C1CCCCC1)C(=O)C(=O)NCC(=O)N[C@H](C(O)=O)c1ccccc1 |r|
Show InChI InChI=1S/C35H51N5O9S2/c1-4-11-24(30(42)33(45)36-19-26(41)39-29(34(46)47)23-14-9-6-10-15-23)37-31(43)25(18-27-50-16-17-51-27)38-32(44)28(22-12-7-5-8-13-22)40-35(48)49-20-21(2)3/h6,9-10,14-15,21-22,24-25,27-29H,4-5,7-8,11-13,16-20H2,1-3H3,(H,36,45)(H,37,43)(H,38,44)(H,39,41)(H,40,48)(H,46,47)/t24?,25-,28-,29-/m0/s1
90 -9.77n/an/an/an/an/a6.530
Schering-Plough Research Institute
Assay Description
Proteolytic cleavage of the ester linkage between the Nva (L-norvaline) and the chromophore (PAP) was monitored for change in absorbance at 370 nm. I...
Bioorg Med Chem Lett 15: 4515-9 (2005)
Article DOI: 10.1016/j.bmcl.2005.07.009
BindingDB Entry DOI: 10.7270/Q298857D