BDBM9951 (8R)-2,15-dimethyl-8-pentyltetracyclo[8.7.0.0^{2,7}.0^{11,15}]heptadeca-3,6-diene-5,14-dione::6-Alkyl 1,4-Diene Steroid 4e
SMILES: CCCCC[C@@H]1CC2C3CCC(=O)C3(C)CCC2C2(C)C=CC(=O)C=C12
InChI Key: InChIKey=WLAOFEXUHCVHAH-ROJXXRNDSA-N
Data: 1 KI  1 IC50
PDB links: 1 PDB ID contains inhibitors having a similarity of 90% to this monomer.
Activity Spreadsheet -- Enzyme Inhibition Constant Data from BindingDB
Found 1 hit for monomerid = 9951
Trg + Lig
Ki
nM
ΔG°
kcal/mole
IC50
nM
Kd
nM
EC50/IC50
nM
koff
s-1
kon
M-1s-1
pHTemp
°C
Cytochrome P450 19A1
(Homo sapiens (Human))
BDBM9951
((8R)-2,15-dimethyl-8-pentyltetracyclo[8.7.0.0^{2,7...)
Show SMILES CCCCC[C@@H]1CC2C3CCC(=O)C3(C)CCC2C2(C)C=CC(=O)C=C12 |r,c:22,t:26|
Show InChI InChI=1S/C24H34O2/c1-4-5-6-7-16-14-18-19-8-9-22(26)24(19,3)13-11-20(18)23(2)12-10-17(25)15-21(16)23/h10,12,15-16,18-20H,4-9,11,13-14H2,1-3H3/t16-,18?,19?,20?,23?,24?/m1/s1
Reactome pathway
5 -11.8 54n/an/an/an/a7.537
Tohoku College of Pharmacy
Assay Description
The enzyme activity was assayed by measuring the 3H-labeled H2O formed from [1beta-3H] Androstenedione during aromatization. After incubation, the re...
J Med Chem 39: 1033-8 (1996)
Article DOI: 10.1021/jm950720u
BindingDB Entry DOI: 10.7270/Q21V5C6P