BDBM99618 US8501936, 119
SMILES: CN(c1ccc(cc1)-c1cccn2nc(Nc3ccc(CN4CCS(=O)(=O)CC4)cc3)nc12)S(C)(=O)=O
InChI Key: InChIKey=FOMSLMYHRMDFKJ-UHFFFAOYSA-N
Data: 3 IC50
Activity Spreadsheet -- Enzyme Inhibition Constant Data from BindingDB
Found 3 hits for monomerid = 99618
Trg + Lig
Ki
nM
ΔG°
kcal/mole
IC50
nM
Kd
nM
EC50/IC50
nM
koff
s-1
kon
M-1s-1
pHTemp
°C
Focal adhesion kinase 1
(Homo sapiens (Human))
BDBM99618
(US8501936, 119)
Show SMILES CN(c1ccc(cc1)-c1cccn2nc(Nc3ccc(CN4CCS(=O)(=O)CC4)cc3)nc12)S(C)(=O)=O
Show InChI InChI=1S/C25H28N6O4S2/c1-29(36(2,32)33)22-11-7-20(8-12-22)23-4-3-13-31-24(23)27-25(28-31)26-21-9-5-19(6-10-21)18-30-14-16-37(34,35)17-15-30/h3-13H,14-18H2,1-2H3,(H,26,28)
NCI pathway
Reactome pathway
US Patent
n/an/a 1.00E+4n/an/an/an/an/an/a
Cephalon, Inc.
US Patent
Assay Description
The ability of compounds to inhibit the kinase activity of baculovirus-expressed human FAK and JAK kinase using the time-resolved fluorescence (TRF) ...
US Patent US8501936 (2013)
BindingDB Entry DOI: 10.7270/Q22Z1455
Tyrosine-protein kinase JAK3
(Homo sapiens (Human))
BDBM99618
(US8501936, 119)
Show SMILES CN(c1ccc(cc1)-c1cccn2nc(Nc3ccc(CN4CCS(=O)(=O)CC4)cc3)nc12)S(C)(=O)=O
Show InChI InChI=1S/C25H28N6O4S2/c1-29(36(2,32)33)22-11-7-20(8-12-22)23-4-3-13-31-24(23)27-25(28-31)26-21-9-5-19(6-10-21)18-30-14-16-37(34,35)17-15-30/h3-13H,14-18H2,1-2H3,(H,26,28)
Reactome pathway
US Patent
n/an/a 11.0n/an/an/an/an/an/a
Cephalon, Inc.
US Patent
Assay Description
The ability of compounds to inhibit the kinase activity of baculovirus-expressed human FAK and JAK kinase using the time-resolved fluorescence (TRF) ...
US Patent US8501936 (2013)
BindingDB Entry DOI: 10.7270/Q22Z1455
Tyrosine-protein kinase JAK2
(Homo sapiens (Human))
BDBM99618
(US8501936, 119)
Show SMILES CN(c1ccc(cc1)-c1cccn2nc(Nc3ccc(CN4CCS(=O)(=O)CC4)cc3)nc12)S(C)(=O)=O
Show InChI InChI=1S/C25H28N6O4S2/c1-29(36(2,32)33)22-11-7-20(8-12-22)23-4-3-13-31-24(23)27-25(28-31)26-21-9-5-19(6-10-21)18-30-14-16-37(34,35)17-15-30/h3-13H,14-18H2,1-2H3,(H,26,28)
Reactome pathway
US Patent
n/an/a 0.270n/an/an/an/an/an/a
Cephalon, Inc.
US Patent
Assay Description
The ability of compounds to inhibit the kinase activity of baculovirus-expressed human FAK and JAK kinase using the time-resolved fluorescence (TRF) ...
US Patent US8501936 (2013)
BindingDB Entry DOI: 10.7270/Q22Z1455