BDBM9968 (8R)-8-hydroxy-2,15-dimethyltetracyclo[8.7.0.0^{2,7}.0^{11,15}]heptadec-6-en-14-one::6-Substituted Androst-4-ene Analog 5a
SMILES: CC12CCC3C(C[C@@H](O)C4=CCCCC34C)C1CCC2=O
InChI Key: InChIKey=UPJODXGWEXHPEK-KTSZXUFWSA-N
Data: 1 KI  1 IC50
Activity Spreadsheet -- Enzyme Inhibition Constant Data from BindingDB
Found 1 hit for monomerid = 9968
Trg + Lig
Ki
nM
ΔG°
kcal/mole
IC50
nM
Kd
nM
EC50/IC50
nM
koff
s-1
kon
M-1s-1
pHTemp
°C
Cytochrome P450 19A1
(Homo sapiens (Human))
BDBM9968
((8R)-8-hydroxy-2,15-dimethyltetracyclo[8.7.0.0^{2,...)
Show SMILES CC12CCC3C(C[C@@H](O)C4=CCCCC34C)C1CCC2=O |r,t:9|
Show InChI InChI=1S/C19H28O2/c1-18-9-4-3-5-15(18)16(20)11-12-13-6-7-17(21)19(13,2)10-8-14(12)18/h5,12-14,16,20H,3-4,6-11H2,1-2H3/t12?,13?,14?,16-,18?,19?/m1/s1
Reactome pathway
6 -11.7 50n/an/an/an/a7.537
Tohoku College of Pharmacy
Assay Description
The enzyme activity was assayed by measuring the 3H-labeled H2O formed from [1beta-3H] Androstenedione during aromatization. After incubation, the re...
J Med Chem 39: 2245-52 (1996)
Article DOI: 10.1021/jm960047o
BindingDB Entry DOI: 10.7270/Q2X34VPV