BDBM99894 US8501767, 82
SMILES: Clc1ccc2nc(c(NC3CCCCC3)n2c1)-c1ccccc1Cl
InChI Key: InChIKey=NFRHKABAUBODFM-UHFFFAOYSA-N
Data: 2 IC50
Activity Spreadsheet -- Enzyme Inhibition Constant Data from BindingDB
Found 2 hits for monomerid = 99894
Trg + Lig
Ki
nM
ΔG°
kcal/mole
IC50
nM
Kd
nM
EC50/IC50
nM
koff
s-1
kon
M-1s-1
pHTemp
°C
Reverse transcriptase
(Human immunodeficiency virus 1)
BDBM99894
(US8501767, 82)
Show SMILES Clc1ccc2nc(c(NC3CCCCC3)n2c1)-c1ccccc1Cl
Show InChI InChI=1S/C19H19Cl2N3/c20-13-10-11-17-23-18(15-8-4-5-9-16(15)21)19(24(17)12-13)22-14-6-2-1-3-7-14/h4-5,8-12,14,22H,1-3,6-7H2
n/an/a 1.45E+4n/an/an/an/an/an/a
CSIR Biosciences
Curated by ChEMBL
Assay Description
Inhibition of HIV1 reverse transcriptase assessed as residual enzyme activity at 50 uM after 1 hr by ELISA
Bioorg Med Chem 19: 4227-37 (2011)
Article DOI: 10.1016/j.bmc.2011.05.062
BindingDB Entry DOI: 10.7270/Q29K4F22
Reverse transcriptase protein
(Human immunodeficiency virus 1)
BDBM99894
(US8501767, 82)
Show SMILES Clc1ccc2nc(c(NC3CCCCC3)n2c1)-c1ccccc1Cl
Show InChI InChI=1S/C19H19Cl2N3/c20-13-10-11-17-23-18(15-8-4-5-9-16(15)21)19(24(17)12-13)22-14-6-2-1-3-7-14/h4-5,8-12,14,22H,1-3,6-7H2
US Patent
n/an/a 1.45E+4n/an/an/an/an/an/a
CSIR
US Patent
Assay Description
The assay is based on a sandwich-ELISA protocol employing the ROCHE colorimetric reverse transcriptase kit (cat # 1468120910).
US Patent US8501767 (2013)
BindingDB Entry DOI: 10.7270/Q2Z60MPS