BDBM9997 (2S,15S)-2-(hydroxymethyl)-15-methyltetracyclo[8.7.0.0^{2,7}.0^{11,15}]heptadec-6-en-14-one::Hydroxylated 3-Deoxy C19 Steroid 3
SMILES: C[C@]12CCC3C(CCC4=CCCC[C@]34CO)C1CCC2=O
InChI Key: InChIKey=UGCIHWZOIVCJGP-CXOXHQNKSA-N
Data: 1 KI  1 IC50
PDB links: 6 PDB IDs contain inhibitors having a similarity of 90% to this monomer.
Activity Spreadsheet -- Enzyme Inhibition Constant Data from BindingDB
Found 1 hit for monomerid = 9997
Trg + Lig
Ki
nM
ΔG°
kcal/mole
IC50
nM
Kd
nM
EC50/IC50
nM
koff
s-1
kon
M-1s-1
pHTemp
°C
Cytochrome P450 19A1
(Homo sapiens (Human))
BDBM9997
((2S,15S)-2-(hydroxymethyl)-15-methyltetracyclo[8.7...)
Show SMILES C[C@]12CCC3C(CCC4=CCCC[C@]34CO)C1CCC2=O |r,t:8|
Show InChI InChI=1S/C19H28O2/c1-18-11-9-16-14(15(18)7-8-17(18)21)6-5-13-4-2-3-10-19(13,16)12-20/h4,14-16,20H,2-3,5-12H2,1H3/t14?,15?,16?,18-,19+/m0/s1
Reactome pathway
5.80 -11.7 49n/an/an/an/a7.537
Tohoku Pharmaceutical University
Assay Description
The enzyme activity was assayed by measuring the 3H-labeled H2O formed from [1beta-3H] Androstenedione during aromatization. After incubation, the re...
J Med Chem 44: 4277-83 (2001)
Article DOI: 10.1021/jm010282t
BindingDB Entry DOI: 10.7270/Q2SB43ZH