Reaction Details
TargetProtein cereblon
LigandBDBM65456
Substrate/Competitorn/a
Meas. Tech.Thalidomide analog bead assay
IC50 2000±0 nM
Citation Lopez-Girona, AMendy, DIto, TMiller, KGandhi, AKKang, JKarasawa, SCarmel, GJackson, PAbbasian, MMahmoudi, ACathers, BRychak, EGaidarova, SChen, RSchafer, PHHanda, HDaniel, TOEvans, JFChopra, R Cereblon is a direct protein target for immunomodulatory and antiproliferative activities of lenalidomide and pomalidomide. Leukemia26:2326-35 (2012) 
 
Protein cereblon
Name:Protein cereblon
Type:PROTEIN
Mol. Mass.:50537.73
Organism:Homo sapiens (Human)
Description:ChEMBL_116917
Residue:442
BDBM65456
NameBDBM65456
Synonyms:19171-19-8 Actimid Pomalyst US20230271966, Compound Pomalidomide pomalidomide
TypeSmall organic molecule
Emp. Form.C13H11N3O4
Mol. Mass.273.2441
SMILESNc1cccc2C(=O)N(C3CCC(=O)NC3=O)C(=O)c12