Reaction Details
TargetProtein cereblon
LigandBDBM65362
Substrate/Competitorn/a
Meas. Tech.Thalidomide analog bead assay
IC50>300000±0 nM
Citation Lopez-Girona, AMendy, DIto, TMiller, KGandhi, AKKang, JKarasawa, SCarmel, GJackson, PAbbasian, MMahmoudi, ACathers, BRychak, EGaidarova, SChen, RSchafer, PHHanda, HDaniel, TOEvans, JFChopra, R Cereblon is a direct protein target for immunomodulatory and antiproliferative activities of lenalidomide and pomalidomide. Leukemia26:2326-35 (2012) 
 
Protein cereblon
Name:Protein cereblon
Type:PROTEIN
Mol. Mass.:50537.73
Organism:Homo sapiens (Human)
Description:ChEMBL_116917
Residue:442
BDBM65362
NameBDBM65362
Synonyms:(+)-Thalidomide (R)-Thalidomide | D-Thalidomide
TypeSmall organic molecule
Emp. Form.C13H10N2O4
Mol. Mass.258.2295
SMILESO=C1N([C@@H]2CCC(=O)NC2=O)C(=O)c2ccccc12