Reaction Details
TargetFibroblast growth factor receptor 1
LigandBDBM302363
Substrate/Competitorn/a
Meas. Tech.High ATP Kinase Assay
IC50 0.700±n/a nM
Citation Collin, MBrohm, DHéroult, MLobell, MHübsch, WLustig, KGrünewald, SBömer, UVöhringer, VLindner, N Substituted benzothienyl-pyrrolotriazines and uses thereof in the treatment cancer US Patent US9598416 Publication Date 3/21/2017
 
Fibroblast growth factor receptor 1
Name:Fibroblast growth factor receptor 1
Type:Receptor
Mol. Mass.:91861.70
Organism:Homo sapiens (Human)
Description:P11362
Residue:822
BDBM302363
NameBDBM302363
Synonyms:N-{[4-Amino-5-(7-methoxy-5-methyl-1-benzothiophen-2-yl)pyrrolo[2,1-f][1,2,4]triazin-6-yl]-methyl}acetamide | US9598416, Example 9
TypeSmall organic molecule
Emp. Form.C19H19N5O2S
Mol. Mass.381.451
SMILESCOc1cc(C)cc2cc(sc12)-c1c(CNC(C)=O)cn2ncnc(N)c12