Reaction Details
TargetFibroblast growth factor receptor 1
LigandBDBM302385
Substrate/Competitorn/a
Meas. Tech.High ATP Kinase Assay
IC50 0.600±n/a nM
Citation Collin, MBrohm, DHéroult, MLobell, MHübsch, WLustig, KGrünewald, SBömer, UVöhringer, VLindner, N Substituted benzothienyl-pyrrolotriazines and uses thereof in the treatment cancer US Patent US9598416 Publication Date 3/21/2017
 
Fibroblast growth factor receptor 1
Name:Fibroblast growth factor receptor 1
Type:Receptor
Mol. Mass.:91861.70
Organism:Homo sapiens (Human)
Description:P11362
Residue:822
BDBM302385
NameBDBM302385
Synonyms:4-{[4-Amino-5-(5-chloro-7-methoxy-1-benzothiophen-2-yl)pyrrolo[2,1-f][1,2,4]triazin-6-yl]methyl}-piperazin-2-one | US9598416, Example 31
TypeSmall organic molecule
Emp. Form.C20H19ClN6O2S
Mol. Mass.442.922
SMILESCOc1cc(Cl)cc2cc(sc12)-c1c(CN2CCNC(=O)C2)cn2ncnc(N)c12