Reaction Details
TargetFibroblast growth factor receptor 1
LigandBDBM302419
Substrate/Competitorn/a
Meas. Tech.High ATP Kinase Assay
IC50 0.700±n/a nM
Citation Collin, MBrohm, DHéroult, MLobell, MHübsch, WLustig, KGrünewald, SBömer, UVöhringer, VLindner, N Substituted benzothienyl-pyrrolotriazines and uses thereof in the treatment cancer US Patent US9598416 Publication Date 3/21/2017
 
Fibroblast growth factor receptor 1
Name:Fibroblast growth factor receptor 1
Type:Receptor
Mol. Mass.:91861.70
Organism:Homo sapiens (Human)
Description:P11362
Residue:822
BDBM302419
NameBDBM302419
Synonyms:US9598416, Example 65
TypeSmall organic molecule
Emp. Form.C23H28N6OS
Mol. Mass.436.573
SMILESCOc1cc(C)cc2cc(sc12)-c1c(CN2CC[C@H](C2)N(C)C)cn2ncnc(N)c12