Reaction Details
TargetcAMP-specific 3',5'-cyclic phosphodiesterase 4B
LigandBDBM285536
Substrate/Competitorn/a
IC50 10.5±n/a nM
Citation Chappie, TAVerhoest, PRPatel, NCHayward, MMHelal, CJSciabola, SLaChapelle, EAYoung, JM Imidazopyridazine compounds US Patent US9598421 Publication Date 3/21/2017
 
cAMP-specific 3',5'-cyclic phosphodiesterase 4B
Name:cAMP-specific 3',5'-cyclic phosphodiesterase 4B
Type:Protein
Mol. Mass.:83318.87
Organism:Homo sapiens (Human)
Description:Q07343
Residue:736
BDBM285536
NameBDBM285536
Synonyms:3-(4-Chloro-2,5-difluorophenyl)-N-cyclopropylimidazo[1,2-b]pyridazine-2-carboxamide (9) US10669279, Example 9 | US9598421, Example 9
TypeSmall organic molecule
Emp. Form.C16H11ClF2N4O
Mol. Mass.348.735
SMILESFc1cc(-c2c(nc3cccnn23)C(=O)NC2CC2)c(F)cc1Cl