Reaction Details
TargetcAMP-specific 3',5'-cyclic phosphodiesterase 4B
LigandBDBM285538
Substrate/Competitorn/a
IC50 1.60±n/a nM
Citation Chappie, TAVerhoest, PRPatel, NCHayward, MMHelal, CJSciabola, SLaChapelle, EAYoung, JM Imidazopyridazine compounds US Patent US9598421 Publication Date 3/21/2017
 
cAMP-specific 3',5'-cyclic phosphodiesterase 4B
Name:cAMP-specific 3',5'-cyclic phosphodiesterase 4B
Type:Protein
Mol. Mass.:83318.87
Organism:Homo sapiens (Human)
Description:Q07343
Residue:736
BDBM285538
NameBDBM285538
Synonyms:N-cyclopropyl-3-(3,4-di-chlorophenyl)imidazo[1,2-b]pyridazine-2-carboxamide US10669279, Example 11 | US9598421, Example 11
TypeSmall organic molecule
Emp. Form.C16H12Cl2N4O
Mol. Mass.347.199
SMILESClc1ccc(cc1Cl)-c1c(nc2cccnn12)C(=O)NC1CC1