Reaction Details
TargetcAMP-specific 3',5'-cyclic phosphodiesterase 4C
LigandBDBM285555
Substrate/Competitorn/a
IC50 49.0±n/a nM
Citation Chappie, TAVerhoest, PRPatel, NCHayward, MMHelal, CJSciabola, SLaChapelle, EAYoung, JM Imidazopyridazine compounds US Patent US9598421 Publication Date 3/21/2017
 
cAMP-specific 3',5'-cyclic phosphodiesterase 4C
Name:cAMP-specific 3',5'-cyclic phosphodiesterase 4C
Type:Enzyme Catalytic Domain
Mol. Mass.:79875.54
Organism:Homo sapiens (Human)
Description:Q08493
Residue:712
BDBM285555
NameBDBM285555
Synonyms:3-(3,5-dichlorophenyl)-N-propylimidazo[1,2-b]pyridazine-2-carboxamide US10669279, Example 28 | US9598421, Example 28
TypeSmall organic molecule
Emp. Form.C16H14Cl2N4O
Mol. Mass.349.215
SMILESCCCNC(=O)c1nc2cccnn2c1-c1cc(Cl)cc(Cl)c1