Reaction Details
TargetcAMP-specific 3',5'-cyclic phosphodiesterase 4C
LigandBDBM285566
Substrate/Competitorn/a
IC50 67.8±n/a nM
Citation Chappie, TAVerhoest, PRPatel, NCHayward, MMHelal, CJSciabola, SLaChapelle, EAYoung, JM Imidazopyridazine compounds US Patent US9598421 Publication Date 3/21/2017
 
cAMP-specific 3',5'-cyclic phosphodiesterase 4C
Name:cAMP-specific 3',5'-cyclic phosphodiesterase 4C
Type:Enzyme Catalytic Domain
Mol. Mass.:79875.54
Organism:Homo sapiens (Human)
Description:Q08493
Residue:712
BDBM285566
NameBDBM285566
Synonyms:3-(1,3-benzoxazol-5-yl)-N-cyclopropylimidazo[1,2-b]pyridazine-2-carboxamide US10669279, Example 39 | US9598421, Example 39
TypeSmall organic molecule
Emp. Form.C17H13N5O2
Mol. Mass.319.3174
SMILESO=C(NC1CC1)c1nc2cccnn2c1-c1ccc2ocnc2c1