Reaction Details
TargetcAMP-specific 3',5'-cyclic phosphodiesterase 4A
LigandBDBM285568
Substrate/Competitorn/a
Meas. Tech.Scintillation Proximity Assay (SPA)
IC50 3.13±n/a nM
Citation Chappie, TAVerhoest, PRPatel, NCHayward, MMHelal, CJSciabola, SLaChapelle, EAYoung, JM Imidazopyridazine compounds US Patent US9598421 Publication Date 3/21/2017
 
cAMP-specific 3',5'-cyclic phosphodiesterase 4A
Name:cAMP-specific 3',5'-cyclic phosphodiesterase 4A
Type:Enzyme
Mol. Mass.:98113.27
Organism:Homo sapiens (Human)
Description:P27815
Residue:886
BDBM285568
NameBDBM285568
Synonyms:N-cyclopropyl-3-(3-fluoro-4-methylphenyl)imidazo[1,2-b]pyridazine-2-carboxamide US10669279, Example 41 | US9598421, Example 41
TypeSmall organic molecule
Emp. Form.C17H15FN4O
Mol. Mass.310.3256
SMILESCc1ccc(cc1F)-c1c(nc2cccnn12)C(=O)NC1CC1