Reaction Details
TargetcAMP-specific 3',5'-cyclic phosphodiesterase 4D
LigandBDBM285568
Substrate/Competitorn/a
IC50 467±n/a nM
Citation Chappie, TAVerhoest, PRPatel, NCHayward, MMHelal, CJSciabola, SLaChapelle, EAYoung, JM Imidazopyridazine compounds US Patent US9598421 Publication Date 3/21/2017
 
cAMP-specific 3',5'-cyclic phosphodiesterase 4D
Name:cAMP-specific 3',5'-cyclic phosphodiesterase 4D
Type:Protein
Mol. Mass.:91092.69
Organism:Homo sapiens (Human)
Description:Q08499
Residue:809
BDBM285568
NameBDBM285568
Synonyms:N-cyclopropyl-3-(3-fluoro-4-methylphenyl)imidazo[1,2-b]pyridazine-2-carboxamide US10669279, Example 41 | US9598421, Example 41
TypeSmall organic molecule
Emp. Form.C17H15FN4O
Mol. Mass.310.3256
SMILESCc1ccc(cc1F)-c1c(nc2cccnn12)C(=O)NC1CC1