Reaction Details
TargetcAMP-specific 3',5'-cyclic phosphodiesterase 4C
LigandBDBM285612
Substrate/Competitorn/a
IC50 43.4±n/a nM
Citation Chappie, TAVerhoest, PRPatel, NCHayward, MMHelal, CJSciabola, SLaChapelle, EAYoung, JM Imidazopyridazine compounds US Patent US9598421 Publication Date 3/21/2017
 
cAMP-specific 3',5'-cyclic phosphodiesterase 4C
Name:cAMP-specific 3',5'-cyclic phosphodiesterase 4C
Type:Enzyme Catalytic Domain
Mol. Mass.:79875.54
Organism:Homo sapiens (Human)
Description:Q08493
Residue:712
BDBM285612
NameBDBM285612
Synonyms:3-(4-chloro-3-fluorophenyl)-N-(1H-pyrazol-4-yl)imidazo[1,2-b]pyridazine-2-carboxamide US10669279, Example 82 | US9598421, Example 82
TypeSmall organic molecule
Emp. Form.C16H10ClFN6O
Mol. Mass.356.742
SMILESFc1cc(ccc1Cl)-c1c(nc2cccnn12)C(=O)Nc1cn[nH]c1