Reaction Details
TargetcAMP-specific 3',5'-cyclic phosphodiesterase 4C
LigandBDBM285613
Substrate/Competitorn/a
IC50 40.0±n/a nM
Citation Chappie, TAVerhoest, PRPatel, NCHayward, MMHelal, CJSciabola, SLaChapelle, EAYoung, JM Imidazopyridazine compounds US Patent US9598421 Publication Date 3/21/2017
 
cAMP-specific 3',5'-cyclic phosphodiesterase 4C
Name:cAMP-specific 3',5'-cyclic phosphodiesterase 4C
Type:Enzyme Catalytic Domain
Mol. Mass.:79875.54
Organism:Homo sapiens (Human)
Description:Q08493
Residue:712
BDBM285613
NameBDBM285613
Synonyms:US10077269, Example 83 US9598421, Example 83 | azetidin-1-yl[3-(3,4-dichloro-phenyl)imidazo[1,2-b]pyridazin-2-yl]methanone
TypeSmall organic molecule
Emp. Form.C16H12Cl2N4O
Mol. Mass.347.199
SMILESClc1ccc(cc1Cl)-c1c(nc2cccnn12)C(=O)N1CCC1