Reaction Details
TargetcAMP-specific 3',5'-cyclic phosphodiesterase 4A
LigandBDBM285626
Substrate/Competitorn/a
Meas. Tech.Scintillation Proximity Assay (SPA)
IC50 4.58±n/a nM
Citation Chappie, TAVerhoest, PRPatel, NCHayward, MMHelal, CJSciabola, SLaChapelle, EAYoung, JM Imidazopyridazine compounds US Patent US9598421 Publication Date 3/21/2017
 
cAMP-specific 3',5'-cyclic phosphodiesterase 4A
Name:cAMP-specific 3',5'-cyclic phosphodiesterase 4A
Type:Enzyme
Mol. Mass.:98113.27
Organism:Homo sapiens (Human)
Description:P27815
Residue:886
BDBM285626
NameBDBM285626
Synonyms:3-(4-chloro-2,5-difluoro-phenyl)-N-ethylimidazo[1,2-b]pyridazine-2-carboxamide US10669279, Example 96 | US9598421, Example 96
TypeSmall organic molecule
Emp. Form.C15H11ClF2N4O
Mol. Mass.336.724
SMILESCCNC(=O)c1nc2cccnn2c1-c1cc(F)c(Cl)cc1F