Reaction Details
TargetcAMP-specific 3',5'-cyclic phosphodiesterase 4B
LigandBDBM285626
Substrate/Competitorn/a
IC50 33.2±n/a nM
Citation Chappie, TAVerhoest, PRPatel, NCHayward, MMHelal, CJSciabola, SLaChapelle, EAYoung, JM Imidazopyridazine compounds US Patent US9598421 Publication Date 3/21/2017
 
cAMP-specific 3',5'-cyclic phosphodiesterase 4B
Name:cAMP-specific 3',5'-cyclic phosphodiesterase 4B
Type:Protein
Mol. Mass.:83318.87
Organism:Homo sapiens (Human)
Description:Q07343
Residue:736
BDBM285626
NameBDBM285626
Synonyms:3-(4-chloro-2,5-difluoro-phenyl)-N-ethylimidazo[1,2-b]pyridazine-2-carboxamide US10669279, Example 96 | US9598421, Example 96
TypeSmall organic molecule
Emp. Form.C15H11ClF2N4O
Mol. Mass.336.724
SMILESCCNC(=O)c1nc2cccnn2c1-c1cc(F)c(Cl)cc1F