Reaction Details
TargetCasein kinase I isoform epsilon
LigandBDBM302450
Substrate/Competitorn/a
Meas. Tech.Kinase Assay
IC50<10±n/a nM
Citation Velaparthi, UDarne, CPLiu, PWittman, MDPearce, BCAraujo, EMDasgupta, BNair, JSJanakiraman, SKRachamreddy, CRMettu, MRKaruppiah, AMReddy, BSNagalakshmi, PBora, ROMaheshwarappa, SHKumaravel, SMullick, DSistla, R Substituted 4,5,6,7-tetrahydropyrazolo[1,5-A]pyrazine derivatives as casein kinase 1 D/E inhibitors US Patent US9598423 Publication Date 3/21/2017
 
Casein kinase I isoform epsilon
Name:Casein kinase I isoform epsilon
Type:Protein
Mol. Mass.:47340.25
Organism:Homo sapiens (Human)
Description:P49674
Residue:416
BDBM302450
NameBDBM302450
Synonyms:2-(3-Fluorophenyl)-N5- (4-fluorophenyl)-6,7- dihydropyrazolo[1,5-a] pyrazine-3,5(4H)- dicarboxamide | US9598423, Example 16
TypeSmall organic molecule
Emp. Form.C20H17F2N5O2
Mol. Mass.397.3781
SMILESNC(=O)c1c2CN(CCn2nc1-c1cccc(F)c1)C(=O)Nc1ccc(F)cc1