Reaction Details
TargetCasein kinase I isoform delta
LigandBDBM302451
Substrate/Competitorn/a
Meas. Tech.Kinase Assay
IC50<10±n/a nM
Citation Velaparthi, UDarne, CPLiu, PWittman, MDPearce, BCAraujo, EMDasgupta, BNair, JSJanakiraman, SKRachamreddy, CRMettu, MRKaruppiah, AMReddy, BSNagalakshmi, PBora, ROMaheshwarappa, SHKumaravel, SMullick, DSistla, R Substituted 4,5,6,7-tetrahydropyrazolo[1,5-A]pyrazine derivatives as casein kinase 1 D/E inhibitors US Patent US9598423 Publication Date 3/21/2017
 
Casein kinase I isoform delta
Name:Casein kinase I isoform delta
Type:Enzyme
Mol. Mass.:47356.76
Organism:Homo sapiens (Human)
Description:P48730
Residue:415
BDBM302451
NameBDBM302451
Synonyms:2-(3-Fluorophenyl)-N5- (2-(4-fluorophenyl) propan-2-yl)-6,7- dihydropyrazolo[1,5-a] pyrazine-3,5(4H)- dicarboxamide | US9598423, Example 17
TypeSmall organic molecule
Emp. Form.C23H23F2N5O2
Mol. Mass.439.4578
SMILESCC(C)(NC(=O)N1CCn2nc(c(C(N)=O)c2C1)-c1cccc(F)c1)c1ccc(F)cc1