Reaction Details
TargetCasein kinase I isoform epsilon
LigandBDBM302457
Substrate/Competitorn/a
Meas. Tech.Kinase Assay
IC50<10±n/a nM
Citation Velaparthi, UDarne, CPLiu, PWittman, MDPearce, BCAraujo, EMDasgupta, BNair, JSJanakiraman, SKRachamreddy, CRMettu, MRKaruppiah, AMReddy, BSNagalakshmi, PBora, ROMaheshwarappa, SHKumaravel, SMullick, DSistla, R Substituted 4,5,6,7-tetrahydropyrazolo[1,5-A]pyrazine derivatives as casein kinase 1 D/E inhibitors US Patent US9598423 Publication Date 3/21/2017
 
Casein kinase I isoform epsilon
Name:Casein kinase I isoform epsilon
Type:Protein
Mol. Mass.:47340.25
Organism:Homo sapiens (Human)
Description:P49674
Residue:416
BDBM302457
NameBDBM302457
Synonyms:2-(3-Fluorophenyl)-N5- ((2R,5S)-octahydro-2,5- methanopentalen-6a-yl)- 6,7-dihydropyrazolo[1,5- a]pyrazine-3,5(4H)- dicarboxamide | US9598423, Example 23
TypeSmall organic molecule
Emp. Form.C23H26FN5O2
Mol. Mass.423.4832
SMILESNC(=O)c1c2CN(CCn2nc1-c1cccc(F)c1)C(=O)NC12CC3CC1CC(C2)C3