Reaction Details
TargetDual specificity calcium/calmodulin-dependent 3',5'-cyclic nucleotide phosphodiesterase 1A
LigandBDBM168126
Substrate/Competitorn/a
Meas. Tech.Enzyme Assay
Ki 0.200±n/a nM
Citation Li, PZheng, HZhao, JWennogle, L Organic compounds US Patent US9598426 Publication Date 3/21/2017
 
Dual specificity calcium/calmodulin-dependent 3',5'-cyclic nucleotide phosphodiesterase 1A
Name:Dual specificity calcium/calmodulin-dependent 3',5'-cyclic nucleotide phosphodiesterase 1A
Type:Protein
Mol. Mass.:61245.69
Organism:Homo sapiens (Human)
Description:P54750
Residue:535
BDBM168126
NameBDBM168126
Synonyms:US9073936, 1 | US9598426, 1
TypeSmall organic molecule
Emp. Form.C25H25FN6O2
Mol. Mass.460.5034
SMILESCN1C2=NC(C)(C)CN2c2nn(Cc3ccc(cc3)C(C)=O)c(Nc3ccc(F)cc3)c2C1=O