Reaction Details
TargetDual specificity calcium/calmodulin-dependent 3',5'-cyclic nucleotide phosphodiesterase 1B
LigandBDBM168127
Substrate/Competitorn/a
Ki 4.00±n/a nM
Citation Li, PZheng, HZhao, JWennogle, L Organic compounds US Patent US9598426 Publication Date 3/21/2017
 
Dual specificity calcium/calmodulin-dependent 3',5'-cyclic nucleotide phosphodiesterase 1B
Name:Dual specificity calcium/calmodulin-dependent 3',5'-cyclic nucleotide phosphodiesterase 1B
Type:Enzyme
Mol. Mass.:61366.51
Organism:Homo sapiens (Human)
Description:n/a
Residue:536
BDBM168127
NameBDBM168127
Synonyms:US9073936, 2 | US9598426, 2
TypeSmall organic molecule
Emp. Form.C25H27FN6O2
Mol. Mass.462.5193
SMILESCC(O)c1ccc(Cn2nc3N4CC(C)(C)N=C4N(C)C(=O)c3c2Nc2ccc(F)cc2)cc1