Reaction Details
TargetNuclear receptor ROR-gamma
LigandBDBM302859
Substrate/Competitorn/a
Meas. Tech.Biological Assay
Ki 6.24±0.73 nM
Citation Morphy, JR Compounds useful for inhibiting ROR-gamma-t US Patent US9598431 Publication Date 3/21/2017
 
Nuclear receptor ROR-gamma
Name:Nuclear receptor ROR-gamma
Type:Enzyme Catalytic Domain
Mol. Mass.:58218.40
Organism:Homo sapiens (Human)
Description:P51449
Residue:518
BDBM302859
NameBDBM302859
Synonyms:(5S′)¿N-{[5-(Ethylsulfonyl)pyridine-2-yl]methyl}-5′-methyl-1-{(1S)-1-[2-(trifluoromethyl)pyrimidin-5-yl]ethyl}-4′,5′-dihydrospiro[piperidine-4,7′thieno[2,3-C]pyran]-2′-carboxamide | US9598431, 2
TypeSmall organic molecule
Emp. Form.C28H32F3N5O4S2
Mol. Mass.623.71
SMILESCCS(=O)(=O)c1ccc(CNC(=O)c2cc3C[C@H](C)OC4(CCN(CC4)[C@@H](C)c4cnc(nc4)C(F)(F)F)c3s2)nc1