Reaction Details
TargetNuclear receptor ROR-alpha
LigandBDBM302860
Substrate/Competitorn/a
Meas. Tech.Biological Assay
Ki>20400±0 nM
Citation Morphy, JR Compounds useful for inhibiting ROR-gamma-t US Patent US9598431 Publication Date 3/21/2017
 
Nuclear receptor ROR-alpha
Name:Nuclear receptor ROR-alpha
Type:PROTEIN
Mol. Mass.:58976.26
Organism:Homo sapiens (Human)
Description:ChEMBL_101591
Residue:523
BDBM302860
NameBDBM302860
Synonyms:(2S)-1-(3-Thienyl)propan-2-ol | US9598431, 3
TypeSmall organic molecule
Emp. Form.C28H32F3N5O4S2
Mol. Mass.623.71
SMILESCCS(=O)(=O)c1ccc(CNC(=O)c2cc3C[C@H](C)OC4(CCN(CC4)[C@H](C)c4cnc(nc4)C(F)(F)F)c3s2)nc1