Reaction Details
TargetSteroid 17-alpha-hydroxylase/17,20 lyase
LigandBDBM144627
Substrate/Competitorn/a
Meas. Tech.SPA Assay
IC50 4.00±n/a nM
Citation Balog, JAHuang, A Substituted bicyclic heteroaryl compounds US Patent US9598436 Publication Date 3/21/2017
 
Steroid 17-alpha-hydroxylase/17,20 lyase
Name:Steroid 17-alpha-hydroxylase/17,20 lyase
Type:Enzyme
Mol. Mass.:57382.42
Organism:Homo sapiens (Human)
Description:E.coli expressing human CYP17
Residue:508
BDBM144627
NameBDBM144627
Synonyms:US8969586, 103 | US9598436, 103
TypeSmall organic molecule
Emp. Form.C17H10ClFN4S
Mol. Mass.356.805
SMILESNc1ncncc1-c1ccnc2c(csc12)-c1ccc(F)cc1Cl