Reaction Details
TargetTyrosine-protein kinase JAK2
LigandBDBM174006
Substrate/Competitorn/a
Meas. Tech.JAK2 Kinase Assay
IC50 4.00±n/a nM
Citation Brasca, MGBindi, SCaldarelli, MNesi, MOrrenius, SCPanzeri, A Substituted pyrroles active as kinases inhibitors US Patent US9688661 Publication Date 6/27/2017
 
Tyrosine-protein kinase JAK2
Name:Tyrosine-protein kinase JAK2
Type:Protein
Mol. Mass.:130684.68
Organism:Homo sapiens (Human)
Description:O60674
Residue:1132
BDBM174006
NameBDBM174006
Synonyms:US9688661, 5-(6-Aminopyrimidin-4-yl)-2-[2-ethyl-5-(trifluoromethyl)phenyl]-1H-pyrrole-3-carboxamide (compd 218)
TypeSmall organic molecule
Emp. Form.C18H15F3N5O
Mol. Mass.374.3398
SMILESCCc1ccc(cc1-c1nc(cc1C(N)=O)-c1cc(N)ncn1)C(F)(F)F