Reaction Details
TargetTyrosine-protein kinase JAK1 [861-1152]
LigandBDBM174018
Substrate/Competitorn/a
Meas. Tech.JAK1 Kinase Assay
IC50 1.00±n/a nM
Citation Brasca, MGBindi, SCaldarelli, MNesi, MOrrenius, SCPanzeri, A Substituted pyrroles active as kinases inhibitors US Patent US9688661 Publication Date 6/27/2017
 
Tyrosine-protein kinase JAK1 [861-1152]
Name:Tyrosine-protein kinase JAK1 [861-1152]
Type:Protein
Mol. Mass.:33439.94
Organism:Homo sapiens (Human)
Description:Human JAK1 variant (861-1152 aa)
Residue:292
BDBM174018
NameBDBM174018
Synonyms:US9688661, 1-(5-Chloro-2-ethylphenyl)-4-(7H-pyrrolo[2,3-d]pyrimidin-4-yl)-1H-pyrrole-2-carboxamide (compd 237)
TypeSmall organic molecule
Emp. Form.C19H16ClN5O
Mol. Mass.365.816
SMILESCCc1ccc(Cl)cc1-c1cn(cc1C(N)=O)-c1ncnc2[nH]ccc12