Reaction Details
TargetInterleukin-1 receptor-associated kinase 4
LigandBDBM302983
Substrate/Competitorn/a
Meas. Tech.Kinase Activity Assay
IC50 0.200±n/a nM
Citation Seganish, WMMcElroy, WTBrumfield, SHerr, RJYet, LYang, JHarding, III, JPHo, GDTulshian, DYu, WWong, MKLavey, BKozlowski, JA Inhibitors of IRAK4 activity US Patent US9598440 Publication Date 3/21/2017
 
Interleukin-1 receptor-associated kinase 4
Name:Interleukin-1 receptor-associated kinase 4
Type:Protein
Mol. Mass.:51519.08
Organism:Homo sapiens (Human)
Description:Q9NWZ3
Residue:460
BDBM302983
NameBDBM302983
Synonyms:US9598440, 124
TypeSmall organic molecule
Emp. Form.C27H31N6O3
Mol. Mass.487.5729
SMILESCc1cc(Nc2ncc(-c3ccc4ccccc4n3)c(N[C@@H]3C[C@@H]([C@@H](O)[C@H]3O)C(C)(C)O)[nH+]2)ccn1