Reaction Details
TargetComplement factor D
LigandBDBM302880
Substrate/Competitorn/a
Meas. Tech.Factor D Assay
IC50<1000±n/a nM
Citation Gadhachanda, VRHashimoto, APais, GWang, QChen, DWang, XAgarwal, ADeshpande, MWiles, JAPhadke, AS Amino compounds for treatment of complement mediated disorders US Patent US9598446 Publication Date 3/21/2017
 
Complement factor D
Name:Complement factor D
Type:Protein
Mol. Mass.:27039.19
Organism:Homo sapiens (Human)
Description:P00746
Residue:253
BDBM302880
NameBDBM302880
Synonyms:(2S,4R)-1-(2-(3- acetyl-5-(pyrimidin-5- ylamino)-1H-indol-1- yl)acetyl)-N-((S)-1- (3-chloro-2- fluorophenyl)-2- hydroxyethyl)-4- fluoropyrrolidine-2- carboxamide US9598446, Compound 7
TypeSmall organic molecule
Emp. Form.C29H27ClF2N6O4
Mol. Mass.597.012
SMILESCC(=O)c1cn(CC(=O)N2C[C@H](F)C[C@H]2C(=O)N[C@H](CO)c2cccc(Cl)c2F)c2ccc(Nc3cncnc3)cc12