Reaction Details
TargetComplement factor D
LigandBDBM303042
Substrate/Competitorn/a
Meas. Tech.Factor D Assay
IC50<1000±n/a nM
Citation Gadhachanda, VRHashimoto, APais, GWang, QChen, DWang, XAgarwal, ADeshpande, MWiles, JAPhadke, AS Amino compounds for treatment of complement mediated disorders US Patent US9598446 Publication Date 3/21/2017
 
Complement factor D
Name:Complement factor D
Type:Protein
Mol. Mass.:27039.19
Organism:Homo sapiens (Human)
Description:P00746
Residue:253
BDBM303042
NameBDBM303042
Synonyms:(2S,4R)-1-(2-(3- acetyl-5-(pyrimidin-5- ylamino)-1H-indol-1- yl)acetyl)-N-(6- bromopyrazin-2-yl)-4- fluoropyrrolidine-2- carboxamide US9598446, Compound 47
TypeSmall organic molecule
Emp. Form.C25H22BrFN8O3
Mol. Mass.581.396
SMILESCC(=O)c1cn(CC(=O)N2C[C@H](F)C[C@H]2C(=O)Nc2cncc(Br)n2)c2ccc(Nc3cncnc3)cc12