Reaction Details
TargetKappa-type opioid receptor
LigandBDBM303061
Substrate/Competitorn/a
Meas. Tech.In Vitro Kappa-Opioid Receptor Binding Assay
Ki 31.5±3.6 nM
Citation Tadesse, DTafesse, LZhou, X Phosphorus-substituted quinoxaline-type piperidine compounds and uses thereof US Patent US9598447 Publication Date 3/21/2017
 
Kappa-type opioid receptor
Name:Kappa-type opioid receptor
Type:G Protein-Coupled Receptor (GPCR)
Mol. Mass.:42648.76
Organism:Homo sapiens (Human)
Description:P41145
Residue:380
BDBM303061
NameBDBM303061
Synonyms:US9598447, Ref No. AA
TypeSmall organic molecule
Emp. Form.C28H38N3O4P
Mol. Mass.511.5928
SMILESCCOP(=O)(OCC)c1nc2ccccc2n([C@@H]2C[C@@H]3CC[C@H](C2)N3C23CC4CC2CC(C3)C4)c1=O