Reaction Details
TargetNociceptin receptor
LigandBDBM303065
Substrate/Competitorn/a
Meas. Tech.In Vitro ORL-1 Receptor Binding Assay
Ki 7.51±0.63 nM
Citation Tadesse, DTafesse, LZhou, X Phosphorus-substituted quinoxaline-type piperidine compounds and uses thereof US Patent US9598447 Publication Date 3/21/2017
 
Nociceptin receptor
Name:Nociceptin receptor
Type:G Protein-Coupled Receptor (GPCR)
Mol. Mass.:40702.87
Organism:Homo sapiens (Human)
Description:P41146
Residue:370
BDBM303065
NameBDBM303065
Synonyms:US9598447, Ref No. HH
TypeSmall organic molecule
Emp. Form.C25H34N3O4P
Mol. Mass.471.5289
SMILESOP(O)(=O)c1nc2ccccc2n([C@@H]2C[C@@H]3CCC[C@H](C2)N3[C@@H]2C[C@H]3CCC[C@H](C3)C2)c1=O