Reaction Details
TargetMu-type opioid receptor
LigandBDBM303069
Substrate/Competitorn/a
Meas. Tech.In Vitro Mu-Opioid Receptor Binding Assay
Ki 29.8±3.4 nM
Citation Tadesse, DTafesse, LZhou, X Phosphorus-substituted quinoxaline-type piperidine compounds and uses thereof US Patent US9598447 Publication Date 3/21/2017
 
Mu-type opioid receptor
Name:Mu-type opioid receptor
Type:G Protein-Coupled Receptor (GPCR)
Mol. Mass.:44789.51
Organism:Homo sapiens (Human)
Description:P35372
Residue:400
BDBM303069
NameBDBM303069
Synonyms:US9598447, Ref No. PP
TypeSmall organic molecule
Emp. Form.C32H46N3O4P
Mol. Mass.567.6991
SMILESCCOP(=O)(OCC)\C=C\c1nc2ccccc2n([C@@H]2C[C@@H]3CCC[C@H](C2)N3[C@@H]2C[C@H]3C[C@H](C)C[C@H](C3)C2)c1=O