Reaction Details
TargetGlycogen synthase kinase-3 beta
LigandBDBM188498
Substrate/Competitorn/a
Meas. Tech.ADP Glo Assay Protocol
IC50 550±n/a nM
Citation Wagner, FFPan, JQDandapani, SGermain, AHolson, EMunoz, BNag, PPLewis, MCHaggarty, SJBishop, JAStegmaier, KWeiwer, MBanerji, V Kinase inhibitors and methods of use thereof US Patent US10137122 Publication Date 11/27/2018
 
Glycogen synthase kinase-3 beta
Name:Glycogen synthase kinase-3 beta
Type:Enzyme
Mol. Mass.:46756.38
Organism:Homo sapiens (Human)
Description:P49841
Residue:420
BDBM188498
NameBDBM188498
Synonyms:3,7,7-trimethyl-4-phenyl-2,4,6,7,8,9-hexahydro-5H-pyrazolo[3,4-b]quinolin-5-one (1) | US10137122, Compound 4
TypeSmall organic molecule
Emp. Form.C19H21N3O
Mol. Mass.307.3895
SMILESCc1[nH]nc2NC3=C(C(c12)c1ccccc1)C(=O)CC(C)(C)C3