Reaction Details
TargetGlycogen synthase kinase-3 alpha
LigandBDBM303141
Substrate/Competitorn/a
Meas. Tech.Caliper Assay
IC50<100±n/a nM
Citation Wagner, FFPan, JQDandapani, SGermain, AHolson, EMunoz, BNag, PPLewis, MCHaggarty, SJBishop, JAStegmaier, KWeiwer, MBanerji, V Kinase inhibitors and methods of use thereof US Patent US10137122 Publication Date 11/27/2018
 
Glycogen synthase kinase-3 alpha
Name:Glycogen synthase kinase-3 alpha
Type:Enzyme
Mol. Mass.:50991.79
Organism:Homo sapiens (Human)
Description:P49840
Residue:483
BDBM303141
NameBDBM303141
Synonyms:US10137122, Compound 13
TypeSmall organic molecule
Emp. Form.C19H20ClN3O
Mol. Mass.341.835
SMILESCc1[nH]nc2NC3=C(C(c12)c1ccccc1Cl)C(=O)CC(C)(C)C3