Reaction Details
TargetGlycogen synthase kinase-3 beta
LigandBDBM188510
Substrate/Competitorn/a
Meas. Tech.ADP Glo Assay Protocol
IC50 3000±n/a nM
Citation Wagner, FFPan, JQDandapani, SGermain, AHolson, EMunoz, BNag, PPLewis, MCHaggarty, SJBishop, JAStegmaier, KWeiwer, MBanerji, V Kinase inhibitors and methods of use thereof US Patent US10137122 Publication Date 11/27/2018
 
Glycogen synthase kinase-3 beta
Name:Glycogen synthase kinase-3 beta
Type:Enzyme
Mol. Mass.:46756.38
Organism:Homo sapiens (Human)
Description:P49841
Residue:420
BDBM188510
NameBDBM188510
Synonyms:(S)-4-(2-methoxyphenyl)-3,7,7-trimethyl-2,4,6,7,8,9-hexahydro-5H-pyrazolo[3,4-b]quinolin-5-one (13) | US10137122, Compound 21
TypeSmall organic molecule
Emp. Form.C20H23N3O2
Mol. Mass.337.4155
SMILESCOc1ccccc1[C@@H]1c2c(C)[nH]nc2NC2=C1C(=O)CC(C)(C)C2