Reaction Details
TargetGlycogen synthase kinase-3 beta
LigandBDBM188509
Substrate/Competitorn/a
Meas. Tech.ADP Glo Assay Protocol
IC50<100±n/a nM
Citation Wagner, FFPan, JQDandapani, SGermain, AHolson, EMunoz, BNag, PPLewis, MCHaggarty, SJBishop, JAStegmaier, KWeiwer, MBanerji, V Kinase inhibitors and methods of use thereof US Patent US10137122 Publication Date 11/27/2018
 
Glycogen synthase kinase-3 beta
Name:Glycogen synthase kinase-3 beta
Type:Enzyme
Mol. Mass.:46756.38
Organism:Homo sapiens (Human)
Description:P49841
Residue:420
BDBM188509
NameBDBM188509
Synonyms:BRD3937 | US10137122, Compound 22
TypeSmall organic molecule
Emp. Form.C20H23N3O2
Mol. Mass.337.4155
SMILESCOc1ccccc1[C@H]1c2c(C)[nH]nc2NC2=C1C(=O)CC(C)(C)C2