Reaction Details
TargetCasein kinase I isoform delta
LigandBDBM303152
Substrate/Competitorn/a
Kd 3000±n/a nM
Citation Wagner, FFPan, JQDandapani, SGermain, AHolson, EMunoz, BNag, PPLewis, MCHaggarty, SJBishop, JAStegmaier, KWeiwer, MBanerji, V Kinase inhibitors and methods of use thereof US Patent US10137122 Publication Date 11/27/2018
 
Casein kinase I isoform delta
Name:Casein kinase I isoform delta
Type:Enzyme
Mol. Mass.:47356.76
Organism:Homo sapiens (Human)
Description:P48730
Residue:415
BDBM303152
NameBDBM303152
Synonyms:US10137122, Compound 24
TypeSmall organic molecule
Emp. Form.C20H23N3O2
Mol. Mass.337.4155
SMILESCOc1ccc(cc1)C1c2c(C)[nH]nc2NC2=C1C(=O)CC(C)(C)C2