Reaction Details
TargetGlycogen synthase kinase-3 alpha
LigandBDBM303153
Substrate/Competitorn/a
Meas. Tech.Caliper Assay
IC50<100±n/a nM
Citation Wagner, FFPan, JQDandapani, SGermain, AHolson, EMunoz, BNag, PPLewis, MCHaggarty, SJBishop, JAStegmaier, KWeiwer, MBanerji, V Kinase inhibitors and methods of use thereof US Patent US10137122 Publication Date 11/27/2018
 
Glycogen synthase kinase-3 alpha
Name:Glycogen synthase kinase-3 alpha
Type:Enzyme
Mol. Mass.:50991.79
Organism:Homo sapiens (Human)
Description:P49840
Residue:483
BDBM303153
NameBDBM303153
Synonyms:US10137122, Compound 25
TypeSmall organic molecule
Emp. Form.C20H23N3OS
Mol. Mass.353.481
SMILESCSc1ccccc1C1c2c(C)[nH]nc2NC2=C1C(=O)CC(C)(C)C2