Reaction Details
TargetGlycogen synthase kinase-3 beta
LigandBDBM188511
Substrate/Competitorn/a
Meas. Tech.ADP Glo Assay Protocol
IC50<100±n/a nM
Citation Wagner, FFPan, JQDandapani, SGermain, AHolson, EMunoz, BNag, PPLewis, MCHaggarty, SJBishop, JAStegmaier, KWeiwer, MBanerji, V Kinase inhibitors and methods of use thereof US Patent US10137122 Publication Date 11/27/2018
 
Glycogen synthase kinase-3 beta
Name:Glycogen synthase kinase-3 beta
Type:Enzyme
Mol. Mass.:46756.38
Organism:Homo sapiens (Human)
Description:P49841
Residue:420
BDBM188511
NameBDBM188511
Synonyms:(S)-3,7,7-Trimethyl-4-(2-(trifluoromethyl)phenyl)-2,4,6,7,8,9-hexahydro-5Hpyrazolo[3,4-b]quinolin-5-one (14) | US10137122, Compound 28
TypeSmall organic molecule
Emp. Form.C20H20F3N3O
Mol. Mass.375.3875
SMILESCc1[nH]nc2NC3=C([C@H](c12)c1ccccc1C(F)(F)F)C(=O)CC(C)(C)C3