Reaction Details
TargetGlycogen synthase kinase-3 beta
LigandBDBM303160
Substrate/Competitorn/a
Meas. Tech.ADP Glo Assay Protocol
IC50<100±n/a nM
Citation Wagner, FFPan, JQDandapani, SGermain, AHolson, EMunoz, BNag, PPLewis, MCHaggarty, SJBishop, JAStegmaier, KWeiwer, MBanerji, V Kinase inhibitors and methods of use thereof US Patent US10137122 Publication Date 11/27/2018
 
Glycogen synthase kinase-3 beta
Name:Glycogen synthase kinase-3 beta
Type:Enzyme
Mol. Mass.:46756.38
Organism:Homo sapiens (Human)
Description:P49841
Residue:420
BDBM303160
NameBDBM303160
Synonyms:US10137122, Compound 32
TypeSmall organic molecule
Emp. Form.C20H20N4O
Mol. Mass.332.399
SMILESCc1[nH]nc2NC3=C(C(c12)c1ccccc1C#N)C(=O)CC(C)(C)C3