Reaction Details
TargetCasein kinase I isoform delta
LigandBDBM188503
Substrate/Competitorn/a
Kd 3000±n/a nM
Citation Wagner, FFPan, JQDandapani, SGermain, AHolson, EMunoz, BNag, PPLewis, MCHaggarty, SJBishop, JAStegmaier, KWeiwer, MBanerji, V Kinase inhibitors and methods of use thereof US Patent US10137122 Publication Date 11/27/2018
 
Casein kinase I isoform delta
Name:Casein kinase I isoform delta
Type:Enzyme
Mol. Mass.:47356.76
Organism:Homo sapiens (Human)
Description:P48730
Residue:415
BDBM188503
NameBDBM188503
Synonyms:3,7,7-trimethyl-4-(pyridin-3-yl)-2,4,6,7,8,9-hexahydro-5H-pyrazolo[3,4-b]quinolin-5-one (6) | US10137122, Compound 37
TypeSmall organic molecule
Emp. Form.C18H20N4O
Mol. Mass.308.3776
SMILESCc1[nH]nc2NC3=C(C(c12)c1cccnc1)C(=O)CC(C)(C)C3