Reaction Details
TargetGlycogen synthase kinase-3 alpha
LigandBDBM303169
Substrate/Competitorn/a
Meas. Tech.Caliper Assay
IC50<100±n/a nM
Citation Wagner, FFPan, JQDandapani, SGermain, AHolson, EMunoz, BNag, PPLewis, MCHaggarty, SJBishop, JAStegmaier, KWeiwer, MBanerji, V Kinase inhibitors and methods of use thereof US Patent US10137122 Publication Date 11/27/2018
 
Glycogen synthase kinase-3 alpha
Name:Glycogen synthase kinase-3 alpha
Type:Enzyme
Mol. Mass.:50991.79
Organism:Homo sapiens (Human)
Description:P49840
Residue:483
BDBM303169
NameBDBM303169
Synonyms:US10137122, Compound 41
TypeSmall organic molecule
Emp. Form.C19H19N5O2
Mol. Mass.349.3865
SMILESCc1[nH]nc2NC3=C(C(c12)c1cccc2nonc12)C(=O)CC(C)(C)C3