Reaction Details
TargetGlycogen synthase kinase-3 beta
LigandBDBM303189
Substrate/Competitorn/a
Meas. Tech.ADP Glo Assay Protocol
IC50<100±n/a nM
Citation Wagner, FFPan, JQDandapani, SGermain, AHolson, EMunoz, BNag, PPLewis, MCHaggarty, SJBishop, JAStegmaier, KWeiwer, MBanerji, V Kinase inhibitors and methods of use thereof US Patent US10137122 Publication Date 11/27/2018
 
Glycogen synthase kinase-3 beta
Name:Glycogen synthase kinase-3 beta
Type:Enzyme
Mol. Mass.:46756.38
Organism:Homo sapiens (Human)
Description:P49841
Residue:420
BDBM303189
NameBDBM303189
Synonyms:US10137122, Compound 62
TypeSmall organic molecule
Emp. Form.C20H17F6N3O
Mol. Mass.429.3589
SMILESCC1(C)CC(=O)C2=C(C1)Nc1n[nH]c(c1C2c1ccccc1C(F)(F)F)C(F)(F)F