Reaction Details
TargetGlycogen synthase kinase-3 beta
LigandBDBM303190
Substrate/Competitorn/a
Meas. Tech.ADP Glo Assay Protocol
IC50<100±n/a nM
Citation Wagner, FFPan, JQDandapani, SGermain, AHolson, EMunoz, BNag, PPLewis, MCHaggarty, SJBishop, JAStegmaier, KWeiwer, MBanerji, V Kinase inhibitors and methods of use thereof US Patent US10137122 Publication Date 11/27/2018
 
Glycogen synthase kinase-3 beta
Name:Glycogen synthase kinase-3 beta
Type:Enzyme
Mol. Mass.:46756.38
Organism:Homo sapiens (Human)
Description:P49841
Residue:420
BDBM303190
NameBDBM303190
Synonyms:US10137122, Compound 63
TypeSmall organic molecule
Emp. Form.C20H16F7N3O
Mol. Mass.447.3494
SMILESCC1(C)CC(=O)C2=C(C1)Nc1n[nH]c(c1C2c1cccc(F)c1C(F)(F)F)C(F)(F)F