Reaction Details
TargetGlycogen synthase kinase-3 alpha
LigandBDBM303203
Substrate/Competitorn/a
Meas. Tech.Caliper Assay
IC50<100±n/a nM
Citation Wagner, FFPan, JQDandapani, SGermain, AHolson, EMunoz, BNag, PPLewis, MCHaggarty, SJBishop, JAStegmaier, KWeiwer, MBanerji, V Kinase inhibitors and methods of use thereof US Patent US10137122 Publication Date 11/27/2018
 
Glycogen synthase kinase-3 alpha
Name:Glycogen synthase kinase-3 alpha
Type:Enzyme
Mol. Mass.:50991.79
Organism:Homo sapiens (Human)
Description:P49840
Residue:483
BDBM303203
NameBDBM303203
Synonyms:US10137122, Compound 76
TypeSmall organic molecule
Emp. Form.C18H17F3N4O
Mol. Mass.362.349
SMILESCC1(C)CC(=O)C2=C(C1)Nc1n[nH]c(c1C2c1cccnc1)C(F)(F)F